Reaction Details
TargetNeuronal acetylcholine receptor subunit alpha-7
LigandBDBM50006623
Substrate/Competitorn/a
Meas. Tech.ChEMBL_1335294 (CHEMBL3238718)
Ki 0.260000±n/a nM
Citation Gao, YKellar, KJYasuda, RPTran, TXiao, YDannals, RFHorti, AG Derivatives of dibenzothiophene for positron emission tomography imaging ofa7-nicotinic acetylcholine receptors. J Med Chem56:7574-89 (2013) 
 
Neuronal acetylcholine receptor subunit alpha-7
Name:Neuronal acetylcholine receptor subunit alpha-7
Type:Enzyme
Mol. Mass.:56502.44
Organism:Rattus norvegicus (Rat)
Description:Q05941
Residue:502
BDBM50006623
NameBDBM50006623
Synonyms:CHEMBL3235501
TypeSmall organic molecule
Emp. Form.C17H17IN2O2
Mol. Mass.406.2337
SMILES[125I]c1occc1-c1cnc2OC3(Cc2c1)CN1CCC3CC1