Reaction Details
TargetNeuronal acetylcholine receptor subunit alpha-4/beta-4
LigandBDBM50006633
Substrate/Competitorn/a
Meas. Tech.ChEMBL_1335309 (CHEMBL3238806)
Ki 100000±n/a nM
Citation Crestey, FJensen, AABorch, MAndreasen, JTAndersen, JBalle, TKristensen, JL Design, synthesis, and biological evaluation of Erythrina alkaloid analogues as neuronal nicotinic acetylcholine receptor antagonists. J Med Chem56:9673-82 (2014) 
 
Neuronal acetylcholine receptor subunit alpha-4/beta-4
Name:Neuronal acetylcholine receptor subunit alpha-4/beta-4
Type:n/a
Mol. Mass.:n/a
Description:ASSAY_ID of EBI is 144014
Components:This complex has 2 components.
Component 1
Name:Neuronal acetylcholine receptor subunit alpha-4
Synonyms:ACHA4_RAT Cholinergic, Nicotinic Alpha4Beta2 Chrna4 Neuronal acetylcholine receptor (alpha4beta2 nAChR) Neuronal acetylcholine receptor subunit alpha 4 beta 2 | Neuronal acetylcholine receptor subunit alpha-4
Type:Enzyme
Mol. Mass.:70196.44
Organism:Rattus norvegicus (Rat)
Description:P09483
Residue:630
Component 2
Name:Neuronal acetylcholine receptor subunit beta-4
Synonyms:ACHB4_RAT Chrnb4 Neuronal acetylcholine receptor non-alpha-2 chain | Neuronal acetylcholine receptor protein beta-4 subunit
Type:Enzyme
Mol. Mass.:55863.89
Organism:Rattus norvegicus (Rat)
Description:P12392
Residue:495
BDBM50006633
NameBDBM50006633
Synonyms:CHEMBL3235509
TypeSmall organic molecule
Emp. Form.C14H19NO2
Mol. Mass.233.3062
SMILESCOc1cc2CCN3CCCC3c2cc1OC