Reaction Details
TargetNeuronal acetylcholine receptor subunit beta-2
LigandBDBM50006630
Substrate/Competitorn/a
Meas. Tech.ChEMBL_1335312 (CHEMBL3238809)
IC50 2300±n/a nM
Citation Crestey, FJensen, AABorch, MAndreasen, JTAndersen, JBalle, TKristensen, JL Design, synthesis, and biological evaluation of Erythrina alkaloid analogues as neuronal nicotinic acetylcholine receptor antagonists. J Med Chem56:9673-82 (2014) 
 
Neuronal acetylcholine receptor subunit beta-2
Name:Neuronal acetylcholine receptor subunit beta-2
Type:PROTEIN
Mol. Mass.:57114.19
Organism:Mus musculus
Description:ChEMBL_108396
Residue:501
BDBM50006630
NameBDBM50006630
Synonyms:CHEMBL3235506
TypeSmall organic molecule
Emp. Form.C17H23NO2
Mol. Mass.273.37
SMILES[H][C@]12CCN3CCc4cc(O)c(OC)cc4[C@]13CCCC2