Reaction Details
TargetNeuronal acetylcholine receptor subunit beta-2
LigandBDBM50014648
Substrate/Competitorn/a
Meas. Tech.ChEMBL_1335312 (CHEMBL3238809)
IC50 12000±n/a nM
Citation Crestey, FJensen, AABorch, MAndreasen, JTAndersen, JBalle, TKristensen, JL Design, synthesis, and biological evaluation of Erythrina alkaloid analogues as neuronal nicotinic acetylcholine receptor antagonists. J Med Chem56:9673-82 (2014) 
 
Neuronal acetylcholine receptor subunit beta-2
Name:Neuronal acetylcholine receptor subunit beta-2
Type:PROTEIN
Mol. Mass.:57114.19
Organism:Mus musculus
Description:ChEMBL_108396
Residue:501
BDBM50014648
NameBDBM50014648
Synonyms:6,7-Dimethoxy-2-methyl-1,2,3,4-tetrahydro-isoquinoline; hydrobromide (o-methylcorypalline) | CHEMBL555787
TypeSmall organic molecule
Emp. Form.C12H17NO2
Mol. Mass.207.2689
SMILESCOc1cc2CCN(C)Cc2cc1OC