Reaction Details
TargetNeuronal acetylcholine receptor subunit beta-2
LigandBDBM50006640
Substrate/Competitorn/a
Meas. Tech.ChEMBL_1335312 (CHEMBL3238809)
IC50 4400±n/a nM
Citation Crestey, FJensen, AABorch, MAndreasen, JTAndersen, JBalle, TKristensen, JL Design, synthesis, and biological evaluation of Erythrina alkaloid analogues as neuronal nicotinic acetylcholine receptor antagonists. J Med Chem56:9673-82 (2014) 
 
Neuronal acetylcholine receptor subunit beta-2
Name:Neuronal acetylcholine receptor subunit beta-2
Type:PROTEIN
Mol. Mass.:57114.19
Organism:Mus musculus
Description:ChEMBL_108396
Residue:501
BDBM50006640
NameBDBM50006640
Synonyms:CHEMBL593001
TypeSmall organic molecule
Emp. Form.C11H15NO2
Mol. Mass.193.2423
SMILESCOc1cc2CCN(C)Cc2cc1O