Reaction Details
TargetSodium-dependent noradrenaline transporter
LigandBDBM50014648
Substrate/Competitorn/a
Meas. Tech.ChEMBL_1335319 (CHEMBL3238816)
Ki 128900±n/a nM
Citation Crestey, FJensen, AABorch, MAndreasen, JTAndersen, JBalle, TKristensen, JL Design, synthesis, and biological evaluation of Erythrina alkaloid analogues as neuronal nicotinic acetylcholine receptor antagonists. J Med Chem56:9673-82 (2014) 
 
Sodium-dependent noradrenaline transporter
Name:Sodium-dependent noradrenaline transporter
Type:Multi-pass membrane protein
Mol. Mass.:69337.72
Organism:Homo sapiens (Human)
Description:P23975
Residue:617
BDBM50014648
NameBDBM50014648
Synonyms:6,7-Dimethoxy-2-methyl-1,2,3,4-tetrahydro-isoquinoline; hydrobromide (o-methylcorypalline) | CHEMBL555787
TypeSmall organic molecule
Emp. Form.C12H17NO2
Mol. Mass.207.2689
SMILESCOc1cc2CCN(C)Cc2cc1OC