Reaction Details
TargetReplication protein A 70 kDa DNA-binding subunit
LigandBDBM50006667
Substrate/Competitorn/a
Meas. Tech.ChEMBL_1336209 (CHEMBL3241316)
Kd 2300±n/a nM
Citation Frank, AOVangamudi, BFeldkamp, MDSouza-Fagundes, EMLuzwick, JWCortez, DOlejniczak, ETWaterson, AGRossanese, OWChazin, WJFesik, SW Discovery of a potent stapled helix peptide that binds to the 70N domain of replication protein A. J Med Chem57:2455-61 (2014) 
 
Replication protein A 70 kDa DNA-binding subunit
Name:Replication protein A 70 kDa DNA-binding subunit
Type:Enzyme
Mol. Mass.:68139.43
Organism:Homo sapiens (Human)
Description:P27694
Residue:616
BDBM50006667
NameBDBM50006667
Synonyms:CHEMBL3236290
TypeSmall organic molecule
Emp. Form.C80H111N17O26
Mol. Mass.1726.8356
SMILESCC(C)C[C@H](NC(=O)[C@H](C)NC(=O)[C@H](Cc1ccccc1)NC(=O)[C@H](Cc1c[nH]c2ccccc12)NC(=O)[C@H](CCC(O)=O)NC(=O)[C@H](CCC(O)=O)NC(=O)[C@H](CC(C)C)NC(=O)[C@H](CC(O)=O)NC(=O)[C@H](C)NC(=O)[C@H](C)NC(=O)[C@@H](NC(=O)[C@H](Cc1ccccc1)NC(=O)[C@H](CC(O)=O)NC(C)=O)[C@@H](C)O)C(=O)N[C@@H](C)C(=O)N[C@@H](CO)C(N)=O