Reaction Details
TargetReplication protein A 70 kDa DNA-binding subunit
LigandBDBM50006678
Substrate/Competitorn/a
Meas. Tech.ChEMBL_1336209 (CHEMBL3241316)
Kd 330±n/a nM
Citation Frank, AOVangamudi, BFeldkamp, MDSouza-Fagundes, EMLuzwick, JWCortez, DOlejniczak, ETWaterson, AGRossanese, OWChazin, WJFesik, SW Discovery of a potent stapled helix peptide that binds to the 70N domain of replication protein A. J Med Chem57:2455-61 (2014) 
 
Replication protein A 70 kDa DNA-binding subunit
Name:Replication protein A 70 kDa DNA-binding subunit
Type:Enzyme
Mol. Mass.:68139.43
Organism:Homo sapiens (Human)
Description:P27694
Residue:616
BDBM50006678
NameBDBM50006678
Synonyms:CHEMBL3236299
TypeSmall organic molecule
Emp. Form.C94H110N16O29S
Mol. Mass.1960.034
SMILESCC(C)C[C@H](NC(=O)[C@H](C)NC(=O)[C@H](Cc1ccccc1)NC(=O)[C@H](Cc1c[nH]c2ccccc12)NC(=O)[C@H](CCC(O)=O)NC(=O)[C@H](CCC(O)=O)NC(=O)[C@H](CC(C)C)NC(=O)[C@H](CC(O)=O)NC(=O)[C@H](CC(O)=O)NC(=O)[C@H](C)NC(=O)[C@@H](NC(=O)[C@H](Cc1ccccc1)NC(=O)[C@H](CC(O)=O)NC(=S)Nc1ccc(c(c1)C(O)=O)-c1c2ccc(O)cc2oc2cc(=O)ccc12)[C@@H](C)O)C(N)=O