Reaction Details
TargetReplication protein A 70 kDa DNA-binding subunit
LigandBDBM50006681
Substrate/Competitorn/a
Meas. Tech.ChEMBL_1336209 (CHEMBL3241316)
Kd 570±n/a nM
Citation Frank, AOVangamudi, BFeldkamp, MDSouza-Fagundes, EMLuzwick, JWCortez, DOlejniczak, ETWaterson, AGRossanese, OWChazin, WJFesik, SW Discovery of a potent stapled helix peptide that binds to the 70N domain of replication protein A. J Med Chem57:2455-61 (2014) 
 
Replication protein A 70 kDa DNA-binding subunit
Name:Replication protein A 70 kDa DNA-binding subunit
Type:Enzyme
Mol. Mass.:68139.43
Organism:Homo sapiens (Human)
Description:P27694
Residue:616
BDBM50006681
NameBDBM50006681
Synonyms:CHEMBL3236302
TypeSmall organic molecule
Emp. Form.C99H119N15O26S
Mol. Mass.1967.154
SMILESCC(C)C[C@H](NC(=O)[C@H](C)NC(=O)[C@H](Cc1ccccc1)NC(=O)[C@H](Cc1c[nH]c2ccccc12)NC(=O)[C@@]1(C)CCC\C=C/CCC[C@@](C)(NC(=O)[C@H](C)NC(=O)[C@@H](NC(=O)[C@H](Cc2ccccc2)NC(=O)[C@H](CC(O)=O)NC(=S)Nc2ccc(c(c2)C(O)=O)-c2c3ccc(O)cc3oc3cc(=O)ccc23)[C@@H](C)O)C(=O)N[C@@H](CC(O)=O)C(=O)N[C@@H](CC(C)C)C(=O)N[C@@H](CCC(O)=O)C(=O)N1)C(O)=O