Reaction Details
TargetHistamine H4 receptor
LigandBDBM50006769
Substrate/Competitorn/a
Meas. Tech.ChEMBL_1336216 (CHEMBL3241464)
Ki 1.7±n/a nM
Citation Savall, BMChavez, FTays, KDunford, PJCowden, JMHack, MDWolin, RLThurmond, RLEdwards, JP Discovery and SAR of 6-alkyl-2,4-diaminopyrimidines as histamine H4 receptor antagonists. J Med Chem57:2429-39 (2014) 
 
Histamine H4 receptor
Name:Histamine H4 receptor
Type:G Protein-Coupled Receptor (GPCR)
Mol. Mass.:44517.02
Organism:Homo sapiens (Human)
Description:Binding assays were using CHO cells stably expressing hH4R receptors.
Residue:390
BDBM50006769
NameBDBM50006769
Synonyms:CHEMBL3236579
TypeSmall organic molecule
Emp. Form.C19H29N5
Mol. Mass.327.4671
SMILESCN[C@@H]1CCN(C1)c1cc(nc(N)n1)C12CC3CC(CC(C3)C1)C2