Reaction Details
TargetHistamine H4 receptor
LigandBDBM50006788
Substrate/Competitorn/a
Meas. Tech.ChEMBL_1336216 (CHEMBL3241464)
Ki 5.0±n/a nM
Citation Savall, BMChavez, FTays, KDunford, PJCowden, JMHack, MDWolin, RLThurmond, RLEdwards, JP Discovery and SAR of 6-alkyl-2,4-diaminopyrimidines as histamine H4 receptor antagonists. J Med Chem57:2429-39 (2014) 
 
Histamine H4 receptor
Name:Histamine H4 receptor
Type:G Protein-Coupled Receptor (GPCR)
Mol. Mass.:44517.02
Organism:Homo sapiens (Human)
Description:Binding assays were using CHO cells stably expressing hH4R receptors.
Residue:390
BDBM50006788
NameBDBM50006788
Synonyms:CHEMBL3236548
TypeSmall organic molecule
Emp. Form.C24H31FN4O
Mol. Mass.410.5275
SMILESCN1CCC(CCCCOc2cc(-c3nc4c(C)c(F)ccc4[nH]3)c(C)cn2)CC1