Reaction Details
TargetProstaglandin D2 receptor 2
LigandBDBM50006830
Substrate/Competitorn/a
Meas. Tech.ChEMBL_1336707 (CHEMBL3240855)
IC50 1.2±n/a nM
Citation Kaila, NFollows, BLeung, LThomason, JHuang, AMoretto, AJanz, KLowe, MMansour, TSHubeau, CPage, KMorgan, PFish, SXu, XWilliams, CSaiah, E Discovery of isoquinolinone indole acetic acids as antagonists of chemoattractant receptor homologous molecule expressed on Th2 cells (CRTH2) for the treatment of allergic inflammatory diseases. J Med Chem57:1299-322 (2014) 
 
Prostaglandin D2 receptor 2
Name:Prostaglandin D2 receptor 2
Type:Enzyme
Mol. Mass.:43295.45
Organism:Homo sapiens (Human)
Description:Q9Y5Y4
Residue:395
BDBM50006830
NameBDBM50006830
Synonyms:CHEMBL3236948
TypeSmall organic molecule
Emp. Form.C23H21FN2O3
Mol. Mass.392.4228
SMILESCC(C)n1cc(-c2c(C)n(CC(O)=O)c3ccc(F)cc23)c2ccccc2c1=O