Reaction Details
TargetProstaglandin D2 receptor 2
LigandBDBM50006866
Substrate/Competitorn/a
Meas. Tech.ChEMBL_1337063 (CHEMBL3242797)
IC50 6.0±n/a nM
Citation Kaila, NFollows, BLeung, LThomason, JHuang, AMoretto, AJanz, KLowe, MMansour, TSHubeau, CPage, KMorgan, PFish, SXu, XWilliams, CSaiah, E Discovery of isoquinolinone indole acetic acids as antagonists of chemoattractant receptor homologous molecule expressed on Th2 cells (CRTH2) for the treatment of allergic inflammatory diseases. J Med Chem57:1299-322 (2014) 
 
Prostaglandin D2 receptor 2
Name:Prostaglandin D2 receptor 2
Type:Enzyme
Mol. Mass.:43295.45
Organism:Homo sapiens (Human)
Description:Q9Y5Y4
Residue:395
BDBM50006866
NameBDBM50006866
Synonyms:CHEMBL3237232
TypeSmall organic molecule
Emp. Form.C23H18F2N2O3
Mol. Mass.408.3974
SMILESCc1c(-c2ccc(=O)n(Cc3ccc(F)cc3)c2)c2cc(F)ccc2n1CC(O)=O