Reaction Details
TargetProstaglandin D2 receptor 2
LigandBDBM50006892
Substrate/Competitorn/a
Meas. Tech.ChEMBL_1337063 (CHEMBL3242797)
IC50 7.0±n/a nM
Citation Kaila, NFollows, BLeung, LThomason, JHuang, AMoretto, AJanz, KLowe, MMansour, TSHubeau, CPage, KMorgan, PFish, SXu, XWilliams, CSaiah, E Discovery of isoquinolinone indole acetic acids as antagonists of chemoattractant receptor homologous molecule expressed on Th2 cells (CRTH2) for the treatment of allergic inflammatory diseases. J Med Chem57:1299-322 (2014) 
 
Prostaglandin D2 receptor 2
Name:Prostaglandin D2 receptor 2
Type:Enzyme
Mol. Mass.:43295.45
Organism:Homo sapiens (Human)
Description:Q9Y5Y4
Residue:395
BDBM50006892
NameBDBM50006892
Synonyms:CHEMBL3236957
TypeSmall organic molecule
Emp. Form.C24H19F3N2O3
Mol. Mass.440.4145
SMILESCc1c(Cc2ccc(=O)n(Cc3c(F)cccc3F)c2)c2cc(F)ccc2n1CC(O)=O