Reaction Details
TargetProstaglandin D2 receptor 2
LigandBDBM50006897
Substrate/Competitorn/a
Meas. Tech.ChEMBL_1337063 (CHEMBL3242797)
IC50 8.0±n/a nM
Citation Kaila, NFollows, BLeung, LThomason, JHuang, AMoretto, AJanz, KLowe, MMansour, TSHubeau, CPage, KMorgan, PFish, SXu, XWilliams, CSaiah, E Discovery of isoquinolinone indole acetic acids as antagonists of chemoattractant receptor homologous molecule expressed on Th2 cells (CRTH2) for the treatment of allergic inflammatory diseases. J Med Chem57:1299-322 (2014) 
 
Prostaglandin D2 receptor 2
Name:Prostaglandin D2 receptor 2
Type:Enzyme
Mol. Mass.:43295.45
Organism:Homo sapiens (Human)
Description:Q9Y5Y4
Residue:395
BDBM50006897
NameBDBM50006897
Synonyms:CHEMBL3237241
TypeSmall organic molecule
Emp. Form.C23H19F2N3O3
Mol. Mass.423.4121
SMILESCc1c(Cc2ccc(=O)n(Cc3cccc(F)c3)n2)c2cc(F)ccc2n1CC(O)=O