Reaction Details
TargetRas-related C3 botulinum toxin substrate 1
LigandBDBM50007190
Substrate/Competitorn/a
Meas. Tech.ChEMBL_1337921 (CHEMBL3241054)
IC50 1100±n/a nM
Citation Ruffoni, AFerri, NBernini, SKRicci, CCorsini, AMaffucci, IClerici, FContini, A 2-Amino-3-(phenylsulfanyl)norbornane-2-carboxylate: an appealing scaffold for the design of Rac1-Tiam1 protein-protein interaction inhibitors. J Med Chem57:2953-62 (2014) 
 
Ras-related C3 botulinum toxin substrate 1
Name:Ras-related C3 botulinum toxin substrate 1
Type:PROTEIN
Mol. Mass.:21455.91
Organism:Homo sapiens (Human)
Description:ChEMBL_1337921
Residue:192
BDBM50007190
NameBDBM50007190
Synonyms:CHEMBL3237589
TypeSmall organic molecule
Emp. Form.C25H30N6O
Mol. Mass.430.5453
SMILESCCn1c2ccccc2c2cc(Nc3ccnc(NCCCN4CCOCC4)n3)ccc12