Reaction Details
TargetGlucagon receptor
LigandBDBM50007225
Substrate/Competitorn/a
Meas. Tech.ChEMBL_1338728 (CHEMBL3242199)
IC50 23±n/a nM
Citation DeMong, DDai, XHwa, JMiller, MLin, SIKang, LStamford, AGreenlee, WYu, WWong, MLavey, BKozlowski, JZhou, GYang, DYPatel, BSoriano, AZhai, YSondey, CZhang, HLachowicz, JGrotz, DCox, KMorrison, RAndreani, TCao, YLiang, MMeng, TMcNamara, PWong, JBradley, PFeng, KIBelani, JChen, PDai, PGauuan, JLin, PZhao, H The discovery of N-((2H-tetrazol-5-yl)methyl)-4-((R)-1-((5r,8R)-8-(tert-butyl)-3-(3,5-dichlorophenyl)-2-oxo-1,4-diazaspiro[4.5]dec-3-en-1-yl)-4,4-dimethylpentyl)benzamide (SCH 900822): a potent and selective glucagon receptor antagonist. J Med Chem57:2601-10 (2014) 
 
Glucagon receptor
Name:Glucagon receptor
Type:Enzyme
Mol. Mass.:54026.92
Organism:Homo sapiens (Human)
Description:P47871
Residue:477
BDBM50007225
NameBDBM50007225
Synonyms:CHEMBL3238217
TypeSmall organic molecule
Emp. Form.C34H43F2N7O2
Mol. Mass.619.7477
SMILESCC(C)(C)CC[C@@H](N1C(=O)C(=N[C@@]11CC[C@@H](CC1)C(C)(C)C)c1cc(F)cc(F)c1)c1ccc(cc1)C(=O)NCc1nn[nH]n1