Reaction Details
TargetPoly [ADP-ribose] polymerase tankyrase-1
LigandBDBM50318567
Substrate/Competitorn/a
Meas. Tech.ChEMBL_1338768 (CHEMBL3242391)
IC50 11±n/a nM
Citation Liscio, PCarotti, AAsciutti, SKarlberg, TBellocchi, DLlacuna, LMacchiarulo, AAaronson, SASchüler, HPellicciari, RCamaioni, E Design, synthesis, crystallographic studies, and preliminary biological appraisal of new substituted triazolo[4,3-b]pyridazin-8-amine derivatives as tankyrase inhibitors. J Med Chem57:2807-12 (2014) 
 
Poly [ADP-ribose] polymerase tankyrase-1
Name:Poly [ADP-ribose] polymerase tankyrase-1
Type:Enzyme
Mol. Mass.:142058.03
Organism:Homo sapiens (Human)
Description:O95271
Residue:1327
BDBM50318567
NameBDBM50318567
Synonyms:2-(4-(Trifluoromethyl)phenyl)-7,8-dihydro-5H-thiopyrano-[4,3-d]pyrimidin-4-ol CHEMBL1086580
TypeSmall organic molecule
Emp. Form.C14H11F3N2OS
Mol. Mass.312.31
SMILESFC(F)(F)c1ccc(cc1)-c1nc2CCSCc2c(=O)[nH]1