Reaction Details
TargetPoly [ADP-ribose] polymerase tankyrase-2
LigandBDBM50007583
Substrate/Competitorn/a
Meas. Tech.ChEMBL_1338771 (CHEMBL3242394)
IC50 56±n/a nM
Citation Liscio, PCarotti, AAsciutti, SKarlberg, TBellocchi, DLlacuna, LMacchiarulo, AAaronson, SASchüler, HPellicciari, RCamaioni, E Design, synthesis, crystallographic studies, and preliminary biological appraisal of new substituted triazolo[4,3-b]pyridazin-8-amine derivatives as tankyrase inhibitors. J Med Chem57:2807-12 (2014) 
 
Poly [ADP-ribose] polymerase tankyrase-2
Name:Poly [ADP-ribose] polymerase tankyrase-2
Type:PROTEIN
Mol. Mass.:126762.23
Organism:Mus musculus
Description:ChEMBL_108291
Residue:1166
BDBM50007583
NameBDBM50007583
Synonyms:CHEBI:62882 | CHEMBL562310
TypeSmall organic molecule
Emp. Form.C25H19N3O3
Mol. Mass.409.4367
SMILES[H][C@]12C[C@]([H])(C=C1)[C@]1([H])C(=O)N(C(=O)[C@]21[H])c1ccc(cc1)C(=O)Nc1cccc2cccnc12