Reaction Details
TargetAndrogen receptor
LigandBDBM50007587
Substrate/Competitorn/a
Meas. Tech.ChEMBL_1339117 (CHEMBL3243252)
EC50 0.074000±n/a nM
Citation Piatnitski Chekler, ELUnwalla, RKhan, TATangirala, RSJohnson, MSt Andre, MAnderson, JTKenney, TChiparri, SMcNally, CKilbourne, EThompson, CNagpal, SWeber, GSchelling, SOwens, JMorris, CAPowell, DVerhoest, PRGilbert, AM 1-(2-Hydroxy-2-methyl-3-phenoxypropanoyl)indoline-4-carbonitrile derivatives as potent and tissue selective androgen receptor modulators. J Med Chem57:2462-71 (2014) 
 
Androgen receptor
Name:Androgen receptor
Type:Receptor
Mol. Mass.:99185.27
Organism:Homo sapiens (Human)
Description:CHO cells were stably transfected with human AR gene.
Residue:920
BDBM50007587
NameBDBM50007587
Synonyms:CHEMBL3238288
TypeSmall organic molecule
Emp. Form.C20H16FN3O3
Mol. Mass.365.3577
SMILESC[C@](O)(COc1ccc(F)cc1C#N)C(=O)N1CCc2c1cccc2C#N