Reaction Details
TargetAndrogen receptor
LigandBDBM50007593
Substrate/Competitorn/a
Meas. Tech.ChEMBL_1339117 (CHEMBL3243252)
EC50 17±n/a nM
Citation Piatnitski Chekler, ELUnwalla, RKhan, TATangirala, RSJohnson, MSt Andre, MAnderson, JTKenney, TChiparri, SMcNally, CKilbourne, EThompson, CNagpal, SWeber, GSchelling, SOwens, JMorris, CAPowell, DVerhoest, PRGilbert, AM 1-(2-Hydroxy-2-methyl-3-phenoxypropanoyl)indoline-4-carbonitrile derivatives as potent and tissue selective androgen receptor modulators. J Med Chem57:2462-71 (2014) 
 
Androgen receptor
Name:Androgen receptor
Type:Receptor
Mol. Mass.:99185.27
Organism:Homo sapiens (Human)
Description:CHO cells were stably transfected with human AR gene.
Residue:920
BDBM50007593
NameBDBM50007593
Synonyms:CHEMBL3238294
TypeSmall organic molecule
Emp. Form.C20H19ClN2O4
Mol. Mass.386.829
SMILESCOc1cc(Cl)ccc1OC[C@](C)(O)C(=O)N1CCc2c1cccc2C#N