Reaction Details
TargetAndrogen receptor
LigandBDBM50007594
Substrate/Competitorn/a
Meas. Tech.ChEMBL_1339118 (CHEMBL3243253)
EC50>10000±n/a nM
Citation Piatnitski Chekler, ELUnwalla, RKhan, TATangirala, RSJohnson, MSt Andre, MAnderson, JTKenney, TChiparri, SMcNally, CKilbourne, EThompson, CNagpal, SWeber, GSchelling, SOwens, JMorris, CAPowell, DVerhoest, PRGilbert, AM 1-(2-Hydroxy-2-methyl-3-phenoxypropanoyl)indoline-4-carbonitrile derivatives as potent and tissue selective androgen receptor modulators. J Med Chem57:2462-71 (2014) 
 
Androgen receptor
Name:Androgen receptor
Type:Receptor
Mol. Mass.:99185.27
Organism:Homo sapiens (Human)
Description:CHO cells were stably transfected with human AR gene.
Residue:920
BDBM50007594
NameBDBM50007594
Synonyms:CHEMBL3238295
TypeSmall organic molecule
Emp. Form.C20H19FN2O4
Mol. Mass.370.3743
SMILESCOc1ccc(OC[C@](C)(O)C(=O)N2CCc3c2cccc3C#N)c(F)c1