Reaction Details
TargetE3 ubiquitin-protein ligase Mdm2
LigandBDBM50448963
Substrate/Competitorn/a
Meas. Tech.ChEMBL_1339579 (CHEMBL3243059)
IC50 1.1±n/a nM
Citation Gonzalez, AZEksterowicz, JBartberger, MDBeck, HPCanon, JChen, AChow, DDuquette, JFox, BMFu, JHuang, XHouze, JBJin, LLi, YLi, ZLing, YLo, MCLong, AMMcGee, LRMcIntosh, JMcMinn, DLOliner, JDOsgood, TRew, YSaiki, AYShaffer, PWortman, SYakowec, PYan, XYe, QYu, DZhao, XZhou, JOlson, SHMedina, JCSun, D Selective and potent morpholinone inhibitors of the MDM2-p53 protein-protein interaction. J Med Chem57:2472-88 (2014) 
 
E3 ubiquitin-protein ligase Mdm2
Name:E3 ubiquitin-protein ligase Mdm2
Type:Oncoprotein
Mol. Mass.:55196.54
Organism:Homo sapiens (Human)
Description:Q00987
Residue:491
BDBM50448963
NameBDBM50448963
Synonyms:CHEMBL3125537 US9593129, Example 351
TypeSmall organic molecule
Emp. Form.C29H35Cl2NO5S
Mol. Mass.580.563
SMILESCC(C)(C)S(=O)(=O)C[C@H](C1CC1)N1[C@@H]([C@H](C[C@](C)(CC(O)=O)C1=O)c1cccc(Cl)c1)c1ccc(Cl)cc1