Reaction Details
Target5-hydroxytryptamine receptor 2A
LigandBDBM50007713
Substrate/Competitorn/a
Meas. Tech.ChEMBL_1339944 (CHEMBL3243814)
Ki 5.5±n/a nM
Citation Li, PZhang, QRobichaud, AJLee, TTomesch, JYao, WBeard, JDSnyder, GLZhu, HPeng, YHendrick, JPVanover, KEDavis, REMates, SWennogle, LP Discovery of a tetracyclic quinoxaline derivative as a potent and orally active multifunctional drug candidate for the treatment of neuropsychiatric and neurological disorders. J Med Chem57:2670-82 (2014) 
 
5-hydroxytryptamine receptor 2A
Name:5-hydroxytryptamine receptor 2A
Type:undefined
Mol. Mass.:52607.65
Organism:Homo sapiens (Human)
Description:P28223
Residue:471
BDBM50007713
NameBDBM50007713
Synonyms:CHEMBL3233422
TypeSmall organic molecule
Emp. Form.C23H26FN3O
Mol. Mass.379.4704
SMILES[H][C@@]12CCN(CCCC(=O)c3ccc(F)cc3)C[C@]1([H])c1cccc3NCCN2c13