Reaction Details
TargetD(2) dopamine receptor
LigandBDBM35254
Substrate/Competitorn/a
Meas. Tech.ChEMBL_1339946 (CHEMBL3243816)
Ki 31±n/a nM
Citation Li, PZhang, QRobichaud, AJLee, TTomesch, JYao, WBeard, JDSnyder, GLZhu, HPeng, YHendrick, JPVanover, KEDavis, REMates, SWennogle, LP Discovery of a tetracyclic quinoxaline derivative as a potent and orally active multifunctional drug candidate for the treatment of neuropsychiatric and neurological disorders. J Med Chem57:2670-82 (2014) 
 
D(2) dopamine receptor
Name:D(2) dopamine receptor
Type:G Protein-Coupled Receptor (GPCR)
Mol. Mass.:50931.60
Organism:Rattus norvegicus (rat)
Description:P61169
Residue:444
BDBM35254
NameBDBM35254
Synonyms:2-methyl-4-(4-methylpiperazin-1-yl)-10H-thieno[2,3-b][1,5]benzodiazepine Olansek Zyprexa | olanzapine
TypeSmall organic molecule
Emp. Form.C17H20N4S
Mol. Mass.312.432
SMILESCN1CCN(CC1)C1=Nc2ccccc2Nc2sc(C)cc12