Reaction Details
TargetProtein arginine N-methyltransferase 1 [11-371]
LigandBDBM50007728
Substrate/Competitorn/a
Meas. Tech.ChEMBL_1334935 (CHEMBL3239251)
IC50 7200±n/a nM
Citation Yan, LYan, CQian, KSu, HKofsky-Wofford, SALee, WCZhao, XHo, MCIvanov, IZheng, YG Diamidine compounds for selective inhibition of protein arginine methyltransferase 1. J Med Chem57:2611-22 (2014) 
 
Protein arginine N-methyltransferase 1 [11-371]
Name:Protein arginine N-methyltransferase 1 [11-371]
Type:Protein
Mol. Mass.:41506.52
Organism:Homo sapiens (Human)
Description:Q99873[11-371]
Residue:361
BDBM50007728
NameBDBM50007728
Synonyms:CHEMBL424121 | DB867
TypeSmall organic molecule
Emp. Form.C17H15N5O
Mol. Mass.305.3339
SMILESNC(=N)c1ccc(cc1)-c1ccc(o1)-c1ccc(nc1)C(N)=N