Reaction Details
TargetProtein arginine N-methyltransferase 6
LigandBDBM50388602
Substrate/Competitorn/a
Meas. Tech.ChEMBL_1334938 (CHEMBL3239254)
IC50 283000±n/a nM
Citation Yan, LYan, CQian, KSu, HKofsky-Wofford, SALee, WCZhao, XHo, MCIvanov, IZheng, YG Diamidine compounds for selective inhibition of protein arginine methyltransferase 1. J Med Chem57:2611-22 (2014) 
 
Protein arginine N-methyltransferase 6
Name:Protein arginine N-methyltransferase 6
Type:Protein
Mol. Mass.:41928.48
Organism:Homo sapiens (Human)
Description:n/a
Residue:375
BDBM50388602
NameBDBM50388602
Synonyms:FURAMIDINE
TypeSmall organic molecule
Emp. Form.C18H16N4O
Mol. Mass.304.3458
SMILESNC(=N)c1ccc(cc1)-c1ccc(o1)-c1ccc(cc1)C(N)=N