Reaction Details
TargetHistone deacetylase 7
LigandBDBM19149
Substrate/Competitorn/a
Meas. Tech.ChEMBL_1335364 (CHEMBL3238943)
IC50 344±n/a nM
Citation Baruchello, RSimoni, DMarchetti, PRondanin, RMangiola, SCostantini, CMeli, MGiannini, GVesci, LCarollo, VBrunetti, TBattistuzzi, GTolomeo, MCabri, W 4,5,6,7-Tetrahydro-isoxazolo-[4,5-c]-pyridines as a new class of cytotoxic Hsp90 inhibitors. Eur J Med Chem76:53-60 (2014) 
 
Histone deacetylase 7
Name:Histone deacetylase 7
Type:Chromatin regulator; hydrolase; repressor
Mol. Mass.:102942.62
Organism:Homo sapiens (Human)
Description:Q8WUI4
Residue:952
BDBM19149
NameBDBM19149
Synonyms:CHEMBL98 SAHA US10188756, Compound SAHA US11505523, Compound SAHA US9353061, SAHA US9695181, Vorinostat Zolinza suberoylanilide hydroxamic acid
TypeSmall organic molecule
Emp. Form.C14H20N2O3
Mol. Mass.264.3202
SMILESONC(=O)CCCCCCC(=O)Nc1ccccc1