Reaction Details
TargetProto-oncogene tyrosine-protein kinase receptor Ret
LigandBDBM50007744
Substrate/Competitorn/a
Meas. Tech.ChEMBL_1335382 (CHEMBL3239033)
IC50 1626±n/a nM
Citation Ji, XPeng, TZhang, XLi, JYang, WTong, LQu, RJiang, HDing, JXie, HLiu, H Design, synthesis and biological evaluation of novel 6-alkenylamides substituted of 4-anilinothieno[2,3-d]pyrimidines as irreversible epidermal growth factor receptor inhibitors. Bioorg Med Chem22:2366-78 (2014) 
 
Proto-oncogene tyrosine-protein kinase receptor Ret
Name:Proto-oncogene tyrosine-protein kinase receptor Ret
Type:Protein
Mol. Mass.:124318.29
Organism:Homo sapiens (Human)
Description:P07949
Residue:1114
BDBM50007744
NameBDBM50007744
Synonyms:CHEMBL3233767
TypeSmall organic molecule
Emp. Form.C15H10ClFN4OS
Mol. Mass.348.783
SMILESFc1ccc(Nc2ncnc3sc(NC(=O)C=C)cc23)cc1Cl