Reaction Details
TargetEpidermal growth factor receptor
LigandBDBM50007761
Substrate/Competitorn/a
Meas. Tech.ChEMBL_1335368 (CHEMBL3238947)
IC50 1040±n/a nM
Citation Ji, XPeng, TZhang, XLi, JYang, WTong, LQu, RJiang, HDing, JXie, HLiu, H Design, synthesis and biological evaluation of novel 6-alkenylamides substituted of 4-anilinothieno[2,3-d]pyrimidines as irreversible epidermal growth factor receptor inhibitors. Bioorg Med Chem22:2366-78 (2014) 
 
Epidermal growth factor receptor
Name:Epidermal growth factor receptor
Type:Receptor Kinase Domain
Mol. Mass.:134279.59
Organism:Homo sapiens (Human)
Description:P00533
Residue:1210
BDBM50007761
NameBDBM50007761
Synonyms:CHEMBL3233771
TypeSmall organic molecule
Emp. Form.C19H19ClFN5O2S
Mol. Mass.435.903
SMILESCOCCNC\C=C\C(=O)Nc1cc2c(Nc3ccc(F)c(Cl)c3)ncnc2s1