Reaction Details
TargetEpidermal growth factor receptor
LigandBDBM50007762
Substrate/Competitorn/a
Meas. Tech.ChEMBL_1335368 (CHEMBL3238947)
IC50 1196±n/a nM
Citation Ji, XPeng, TZhang, XLi, JYang, WTong, LQu, RJiang, HDing, JXie, HLiu, H Design, synthesis and biological evaluation of novel 6-alkenylamides substituted of 4-anilinothieno[2,3-d]pyrimidines as irreversible epidermal growth factor receptor inhibitors. Bioorg Med Chem22:2366-78 (2014) 
 
Epidermal growth factor receptor
Name:Epidermal growth factor receptor
Type:Receptor Kinase Domain
Mol. Mass.:134279.59
Organism:Homo sapiens (Human)
Description:P00533
Residue:1210
BDBM50007762
NameBDBM50007762
Synonyms:CHEMBL3233772
TypeSmall organic molecule
Emp. Form.C21H24ClFN6OS
Mol. Mass.462.971
SMILESCN(C)CCCNC\C=C\C(=O)Nc1cc2c(Nc3ccc(F)c(Cl)c3)ncnc2s1