Reaction Details
TargetEpidermal growth factor receptor
LigandBDBM50007769
Substrate/Competitorn/a
Meas. Tech.ChEMBL_1335368 (CHEMBL3238947)
IC50 2.0±n/a nM
Citation Ji, XPeng, TZhang, XLi, JYang, WTong, LQu, RJiang, HDing, JXie, HLiu, H Design, synthesis and biological evaluation of novel 6-alkenylamides substituted of 4-anilinothieno[2,3-d]pyrimidines as irreversible epidermal growth factor receptor inhibitors. Bioorg Med Chem22:2366-78 (2014) 
 
Epidermal growth factor receptor
Name:Epidermal growth factor receptor
Type:Receptor Kinase Domain
Mol. Mass.:134279.59
Organism:Homo sapiens (Human)
Description:P00533
Residue:1210
BDBM50007769
NameBDBM50007769
Synonyms:CHEMBL3233779
TypeSmall organic molecule
Emp. Form.C21H23ClFN5O3S
Mol. Mass.479.955
SMILESCOC(CN(C)C\C=C\C(=O)Nc1cc2c(Nc3ccc(F)c(Cl)c3)ncnc2s1)OC