Reaction Details
TargetEpidermal growth factor receptor
LigandBDBM50007772
Substrate/Competitorn/a
Meas. Tech.ChEMBL_1335368 (CHEMBL3238947)
IC50 38±n/a nM
Citation Ji, XPeng, TZhang, XLi, JYang, WTong, LQu, RJiang, HDing, JXie, HLiu, H Design, synthesis and biological evaluation of novel 6-alkenylamides substituted of 4-anilinothieno[2,3-d]pyrimidines as irreversible epidermal growth factor receptor inhibitors. Bioorg Med Chem22:2366-78 (2014) 
 
Epidermal growth factor receptor
Name:Epidermal growth factor receptor
Type:Receptor Kinase Domain
Mol. Mass.:134279.59
Organism:Homo sapiens (Human)
Description:P00533
Residue:1210
BDBM50007772
NameBDBM50007772
Synonyms:CHEMBL3233782
TypeSmall organic molecule
Emp. Form.C19H17ClFN5O2S
Mol. Mass.433.887
SMILESOC1CN(C\C=C\C(=O)Nc2cc3c(Nc4ccc(F)c(Cl)c4)ncnc3s2)C1