Reaction Details
TargetUbiquitin carboxyl-terminal hydrolase 21
LigandBDBM50007790
Substrate/Competitorn/a
Meas. Tech.ChEMBL_1335828 (CHEMBL3239937)
IC50>31000±n/a nM
Citation Báez-Santos, YMBarraza, SJWilson, MWAgius, MPMielech, AMDavis, NMBaker, SCLarsen, SDMesecar, AD X-ray structural and biological evaluation of a series of potent and highly selective inhibitors of human coronavirus papain-like proteases. J Med Chem57:2393-412 (2014) 
 
Ubiquitin carboxyl-terminal hydrolase 21
Name:Ubiquitin carboxyl-terminal hydrolase 21
Type:PROTEIN
Mol. Mass.:62692.84
Organism:Homo sapiens (Human)
Description:ChEMBL_105198
Residue:565
BDBM50007790
NameBDBM50007790
Synonyms:CHEMBL3233814 | med.21724, Compound 169
TypeSmall organic molecule
Emp. Form.C25H27FN2O
Mol. Mass.390.4931
SMILESC[C@@H](N1CCC(CC1)C(=O)NCc1ccc(F)cc1)c1cccc2ccccc12