Reaction Details
TargetReplicase polyprotein 1a
LigandBDBM50007794
Substrate/Competitorn/a
Meas. Tech.ChEMBL_1335833 (CHEMBL3239942)
IC50 59000±n/a nM
Citation Báez-Santos, YMBarraza, SJWilson, MWAgius, MPMielech, AMDavis, NMBaker, SCLarsen, SDMesecar, AD X-ray structural and biological evaluation of a series of potent and highly selective inhibitors of human coronavirus papain-like proteases. J Med Chem57:2393-412 (2014) 
 
Replicase polyprotein 1a
Name:Replicase polyprotein 1a
Type:PROTEIN
Mol. Mass.:451392.15
Organism:Human coronavirus NL63
Description:ChEMBL_108271
Residue:4060
BDBM50007794
NameBDBM50007794
Synonyms:CHEMBL3233822
TypeSmall organic molecule
Emp. Form.C25H29N3O2
Mol. Mass.403.5167
SMILESCOc1cc(CNC(=O)C2CCN(CC2)[C@H](C)c2cccc3ccccc23)ccn1