Reaction Details
TargetGamma-butyrobetaine dioxygenase
LigandBDBM50007906
Substrate/Competitorn/a
Meas. Tech.ChEMBL_1337519 (CHEMBL3242134)
Ki 16000±n/a nM
Citation Tars, KLeitans, JKazaks, AZelencova, DLiepinsh, EKuka, JMakrecka, MLola, DAndrianovs, VGustina, DGrinberga, SLiepinsh, EKalvinsh, IDambrova, MLoza, EPugovics, O Targeting carnitine biosynthesis: discovery of new inhibitors against¿-butyrobetaine hydroxylase. J Med Chem57:2213-36 (2014) 
 
Gamma-butyrobetaine dioxygenase
Name:Gamma-butyrobetaine dioxygenase
Type:PROTEIN
Mol. Mass.:44715.93
Organism:Homo sapiens (Human)
Description:ChEMBL_1434107
Residue:387
BDBM50007906
NameBDBM50007906
Synonyms:Meldonium
TypeSmall organic molecule
Emp. Form.C6H14N2O2
Mol. Mass.146.1876
SMILESC[N+](C)(C)NCCC([O-])=O