Reaction Details
TargetFe(3+)-Zn(2+) purple acid phosphatase
LigandBDBM50162816
Substrate/Competitorn/a
Meas. Tech.ChEMBL_1337988 (CHEMBL3241395)
Ki 140000±n/a nM
Citation McGeary, RPSchenk, GGuddat, LW The applications of binuclear metallohydrolases in medicine: recent advances in the design and development of novel drug leads for purple acid phosphatases, metallo-ß-lactamases and arginases. Eur J Med Chem76:132-44 (2014) 
 
Fe(3+)-Zn(2+) purple acid phosphatase
Name:Fe(3+)-Zn(2+) purple acid phosphatase
Type:PROTEIN
Mol. Mass.:52875.57
Organism:Phaseolus vulgaris
Description:ChEMBL_560427
Residue:459
BDBM50162816
NameBDBM50162816
Synonyms:CHEMBL180570 Methylene diphsphonate methylenediphosphonic acid
TypeSmall organic molecule
Emp. Form.CH6O6P2
Mol. Mass.176.0023
SMILESOP(O)(=O)CP(O)(O)=O