Reaction Details
TargetHeat shock protein HSP 90-alpha
LigandBDBM50008239
Substrate/Competitorn/a
Meas. Tech.ChEMBL_1338401 (CHEMBL3240454)
IC50 17±n/a nM
Citation Taddei, MFerrini, SGiannotti, LCorsi, MManetti, FGiannini, GVesci, LMilazzo, FMAlloatti, DGuglielmi, MBCastorina, MCervoni, MLBarbarino, MFoderà, RCarollo, VPisano, CArmaroli, SCabri, W Synthesis and evaluation of new Hsp90 inhibitors based on a 1,4,5-trisubstituted 1,2,3-triazole scaffold. J Med Chem57:2258-74 (2014) 
 
Heat shock protein HSP 90-alpha
Name:Heat shock protein HSP 90-alpha
Type:Molecular Chaperone
Mol. Mass.:84623.45
Organism:Homo sapiens (Human)
Description:P07900
Residue:732
BDBM50008239
NameBDBM50008239
Synonyms:CHEMBL3235112
TypeSmall organic molecule
Emp. Form.C25H30ClN5O4
Mol. Mass.499.99
SMILESCC(C)c1cc(c(O)cc1O)-n1nnc(C(=O)NCCCl)c1-c1ccc(CN2CCOCC2)cc1