Reaction Details
TargetHeat shock protein HSP 90-alpha
LigandBDBM50008249
Substrate/Competitorn/a
Meas. Tech.ChEMBL_1338401 (CHEMBL3240454)
IC50 36±n/a nM
Citation Taddei, MFerrini, SGiannotti, LCorsi, MManetti, FGiannini, GVesci, LMilazzo, FMAlloatti, DGuglielmi, MBCastorina, MCervoni, MLBarbarino, MFoderà, RCarollo, VPisano, CArmaroli, SCabri, W Synthesis and evaluation of new Hsp90 inhibitors based on a 1,4,5-trisubstituted 1,2,3-triazole scaffold. J Med Chem57:2258-74 (2014) 
 
Heat shock protein HSP 90-alpha
Name:Heat shock protein HSP 90-alpha
Type:Molecular Chaperone
Mol. Mass.:84623.45
Organism:Homo sapiens (Human)
Description:P07900
Residue:732
BDBM50008249
NameBDBM50008249
Synonyms:CHEMBL3234760
TypeSmall organic molecule
Emp. Form.C28H31N5O2
Mol. Mass.469.578
SMILESCC(C)c1cc(c(O)cc1O)-n1nncc1-c1ccc(CN2CCN(CC2)c2ccccc2)cc1