Reaction Details
TargetCarboxypeptidase B2
LigandBDBM50008270
Substrate/Competitorn/a
Meas. Tech.ChEMBL_1339183 (CHEMBL3243346)
IC50 620±n/a nM
Citation Brink, MDahlén, AOlsson, TPolla, MSvensson, T Design and synthesis of conformationally restricted inhibitors of active thrombin activatable fibrinolysis inhibitor (TAFIa). Bioorg Med Chem22:2261-8 (2014) 
 
Carboxypeptidase B2
Name:Carboxypeptidase B2
Type:Enzyme
Mol. Mass.:48432.74
Organism:Homo sapiens (Human)
Description:Q96IY4
Residue:423
BDBM50008270
NameBDBM50008270
Synonyms:CHEMBL3235131
TypeSmall organic molecule
Emp. Form.C11H20N4O2
Mol. Mass.240.3021
SMILESCCCn1cnc(CC(NCCN)C(O)=O)c1