Reaction Details
TargetCarboxypeptidase B2
LigandBDBM50135933
Substrate/Competitorn/a
Meas. Tech.ChEMBL_1339182 (CHEMBL3243345)
IC50 31000±n/a nM
Citation Brink, MDahlén, AOlsson, TPolla, MSvensson, T Design and synthesis of conformationally restricted inhibitors of active thrombin activatable fibrinolysis inhibitor (TAFIa). Bioorg Med Chem22:2261-8 (2014) 
 
Carboxypeptidase B2
Name:Carboxypeptidase B2
Type:Enzyme
Mol. Mass.:48432.74
Organism:Homo sapiens (Human)
Description:Q96IY4
Residue:423
BDBM50135933
NameBDBM50135933
Synonyms:3-(6-Amino-pyridin-3-yl)-2-(1H-imidazol-4-yl)-propionic acid | CHEMBL302067
TypeSmall organic molecule
Emp. Form.C11H12N4O2
Mol. Mass.232.2386
SMILESNc1ccc(CC(C(O)=O)c2cnc[nH]2)cn1