Reaction Details
TargetCarboxypeptidase B2
LigandBDBM50008277
Substrate/Competitorn/a
Meas. Tech.ChEMBL_1339189 (CHEMBL3243352)
IC50 2270±n/a nM
Citation Brink, MDahlén, AOlsson, TPolla, MSvensson, T Design and synthesis of conformationally restricted inhibitors of active thrombin activatable fibrinolysis inhibitor (TAFIa). Bioorg Med Chem22:2261-8 (2014) 
 
Carboxypeptidase B2
Name:Carboxypeptidase B2
Type:Enzyme
Mol. Mass.:48432.74
Organism:Homo sapiens (Human)
Description:Q96IY4
Residue:423
BDBM50008277
NameBDBM50008277
Synonyms:CHEMBL3235138
TypeSmall organic molecule
Emp. Form.C13H21N3O2
Mol. Mass.251.3247
SMILESCCc1cnc2CC(CCCN)(CCn12)C(O)=O