Reaction Details
TargetCarboxypeptidase B2
LigandBDBM50008279
Substrate/Competitorn/a
Meas. Tech.ChEMBL_1339189 (CHEMBL3243352)
IC50<41±n/a nM
Citation Brink, MDahlén, AOlsson, TPolla, MSvensson, T Design and synthesis of conformationally restricted inhibitors of active thrombin activatable fibrinolysis inhibitor (TAFIa). Bioorg Med Chem22:2261-8 (2014) 
 
Carboxypeptidase B2
Name:Carboxypeptidase B2
Type:Enzyme
Mol. Mass.:48432.74
Organism:Homo sapiens (Human)
Description:Q96IY4
Residue:423
BDBM50008279
NameBDBM50008279
Synonyms:CHEMBL3235140
TypeSmall organic molecule
Emp. Form.C23H24Cl3N3O2
Mol. Mass.480.815
SMILESCl.NCCC[C@]1(CCn2c(C1)ncc2-c1cccc(c1)-c1ccc(Cl)cc1Cl)C(O)=O