Reaction Details
TargetCarboxypeptidase N catalytic chain
LigandBDBM50008271
Substrate/Competitorn/a
Meas. Tech.ChEMBL_1339191 (CHEMBL3243354)
IC50>1000000±n/a nM
Citation Brink, MDahlén, AOlsson, TPolla, MSvensson, T Design and synthesis of conformationally restricted inhibitors of active thrombin activatable fibrinolysis inhibitor (TAFIa). Bioorg Med Chem22:2261-8 (2014) 
 
Carboxypeptidase N catalytic chain
Name:Carboxypeptidase N catalytic chain
Type:PROTEIN
Mol. Mass.:52293.66
Organism:Homo sapiens (Human)
Description:ChEMBL_1496379
Residue:458
BDBM50008271
NameBDBM50008271
Synonyms:CHEMBL3235132
TypeSmall organic molecule
Emp. Form.C14H23N3O2
Mol. Mass.265.3513
SMILESCCCn1cnc2C[C@@](CCCN)(CCc12)C(O)=O