Reaction Details
TargetCarboxypeptidase N catalytic chain
LigandBDBM50008274
Substrate/Competitorn/a
Meas. Tech.ChEMBL_1339191 (CHEMBL3243354)
IC50>1000000±n/a nM
Citation Brink, MDahlén, AOlsson, TPolla, MSvensson, T Design and synthesis of conformationally restricted inhibitors of active thrombin activatable fibrinolysis inhibitor (TAFIa). Bioorg Med Chem22:2261-8 (2014) 
 
Carboxypeptidase N catalytic chain
Name:Carboxypeptidase N catalytic chain
Type:PROTEIN
Mol. Mass.:52293.66
Organism:Homo sapiens (Human)
Description:ChEMBL_1496379
Residue:458
BDBM50008274
NameBDBM50008274
Synonyms:CHEMBL3235135
TypeSmall organic molecule
Emp. Form.C24H27N3O2
Mol. Mass.389.4901
SMILESNCCC[C@]1(CCc2c(C1)ncn2Cc1cccc(c1)-c1ccccc1)C(O)=O