Reaction Details
TargetCarboxypeptidase N catalytic chain
LigandBDBM50008278
Substrate/Competitorn/a
Meas. Tech.ChEMBL_1339191 (CHEMBL3243354)
IC50>1000000±n/a nM
Citation Brink, MDahlén, AOlsson, TPolla, MSvensson, T Design and synthesis of conformationally restricted inhibitors of active thrombin activatable fibrinolysis inhibitor (TAFIa). Bioorg Med Chem22:2261-8 (2014) 
 
Carboxypeptidase N catalytic chain
Name:Carboxypeptidase N catalytic chain
Type:PROTEIN
Mol. Mass.:52293.66
Organism:Homo sapiens (Human)
Description:ChEMBL_1496379
Residue:458
BDBM50008278
NameBDBM50008278
Synonyms:CHEMBL3235139
TypeSmall organic molecule
Emp. Form.C17H21N3O2
Mol. Mass.299.3675
SMILESNCCC[C@]1(CCn2c(C1)ncc2-c1ccccc1)C(O)=O