Reaction Details
TargetCarbonic anhydrase 1
LigandBDBM50008323
Substrate/Competitorn/a
Meas. Tech.ChEMBL_1334957 (CHEMBL3239310)
Ki 405±n/a nM
Citation Congiu, COnnis, VBalboni, GSupuran, CT Synthesis and carbonic anhydrase I, II, IX and XII inhibition studies of 4-N,N-disubstituted sulfanilamides incorporating 4,4,4-trifluoro-3-oxo-but-1-enyl, phenacylthiourea and imidazol-2(3H)-one/thione moieties. Bioorg Med Chem Lett24:1776-9 (2014) 
 
Carbonic anhydrase 1
Name:Carbonic anhydrase 1
Type:Enzyme
Mol. Mass.:28873.37
Organism:Homo sapiens (Human)
Description:P00915
Residue:261
BDBM50008323
NameBDBM50008323
Synonyms:CHEMBL3235166
TypeSmall organic molecule
Emp. Form.C17H14ClF3N2O3S
Mol. Mass.418.818
SMILESNS(=O)(=O)c1ccc(cc1)N(Cc1ccc(Cl)cc1)\C=C\C(=O)C(F)(F)F