Reaction Details
TargetCarbonic anhydrase 2
LigandBDBM50008332
Substrate/Competitorn/a
Meas. Tech.ChEMBL_1334958 (CHEMBL3239311)
Ki 275±n/a nM
Citation Congiu, COnnis, VBalboni, GSupuran, CT Synthesis and carbonic anhydrase I, II, IX and XII inhibition studies of 4-N,N-disubstituted sulfanilamides incorporating 4,4,4-trifluoro-3-oxo-but-1-enyl, phenacylthiourea and imidazol-2(3H)-one/thione moieties. Bioorg Med Chem Lett24:1776-9 (2014) 
 
Carbonic anhydrase 2
Name:Carbonic anhydrase 2
Type:Enzyme
Mol. Mass.:29250.71
Organism:Homo sapiens (Human)
Description:P00918
Residue:260
BDBM50008332
NameBDBM50008332
Synonyms:CHEMBL3235168
TypeSmall organic molecule
Emp. Form.C18H14ClF3N2O4S
Mol. Mass.446.828
SMILESNS(=O)(=O)c1ccc(cc1)N(CC(=O)c1ccc(Cl)cc1)\C=C\C(=O)C(F)(F)F