Reaction Details
TargetCarbonic anhydrase 2
LigandBDBM50008343
Substrate/Competitorn/a
Meas. Tech.ChEMBL_1334958 (CHEMBL3239311)
Ki 510±n/a nM
Citation Congiu, COnnis, VBalboni, GSupuran, CT Synthesis and carbonic anhydrase I, II, IX and XII inhibition studies of 4-N,N-disubstituted sulfanilamides incorporating 4,4,4-trifluoro-3-oxo-but-1-enyl, phenacylthiourea and imidazol-2(3H)-one/thione moieties. Bioorg Med Chem Lett24:1776-9 (2014) 
 
Carbonic anhydrase 2
Name:Carbonic anhydrase 2
Type:Enzyme
Mol. Mass.:29250.71
Organism:Homo sapiens (Human)
Description:P00918
Residue:260
BDBM50008343
NameBDBM50008343
Synonyms:CHEMBL3235172
TypeSmall organic molecule
Emp. Form.C18H18ClN3O5S2
Mol. Mass.455.936
SMILESCCOC(=O)NC(=S)N(CC(=O)c1ccc(Cl)cc1)c1ccc(cc1)S(N)(=O)=O