Reaction Details
TargetCarbonic anhydrase 12
LigandBDBM50008334
Substrate/Competitorn/a
Meas. Tech.ChEMBL_1334960 (CHEMBL3239313)
Ki 29±n/a nM
Citation Congiu, COnnis, VBalboni, GSupuran, CT Synthesis and carbonic anhydrase I, II, IX and XII inhibition studies of 4-N,N-disubstituted sulfanilamides incorporating 4,4,4-trifluoro-3-oxo-but-1-enyl, phenacylthiourea and imidazol-2(3H)-one/thione moieties. Bioorg Med Chem Lett24:1776-9 (2014) 
 
Carbonic anhydrase 12
Name:Carbonic anhydrase 12
Type:Enzyme
Mol. Mass.:39456.00
Organism:Homo sapiens (Human)
Description:Catalytic domain of human cloned isozyme was used in the assay
Residue:354
BDBM50008334
NameBDBM50008334
Synonyms:CHEMBL3235169
TypeSmall organic molecule
Emp. Form.C18H14F4N2O4S
Mol. Mass.430.373
SMILESNS(=O)(=O)c1ccc(cc1)N(CC(=O)c1ccc(F)cc1)\C=C\C(=O)C(F)(F)F